{"text_format":"2","workbook":"xlsx","n_sheets":2,"sheets":["Sheet1","#表格说明"],"not_rendered":{"charts":0,"images":0,"macros":0,"external_links":0,"defined_names":0,"comments":0,"pivot_tables":0},"unopened":[],"bounds":{"document_bytes":16777216,"sheet_cells":100000,"run_cost":"one","rows_first":2000,"rows_last":500,"rows_between":2000,"halvings":0,"cell_chars":16384,"cell_head_chars":4096},"cells_cut":0,"cells_raw":0,"read":"whole","date_system":"1900"}

{"sheet":"Sheet1","index":0,"n_rows":107,"n_cols":22,"rows_kept":107,"cut":false,"hidden":false,"merged":[]}
[{"$nulls":4},"此列用于配置其他表格用,填写id即可,不可删除","#enum \n1.材料|MaterialConfig\n2.道具|FunctionItemConfig\n3.菜品|CuisineConfig\n4.药品|MedicineConfig\n5.装备|EquipmentConfig",null,"#enum \n0.不放在仓库中|Not_in\n1.材料|Material\n2.装备|Equipment\n3.道具|FunctionItem\n4.宝石|Gemstone\n5.杂项|Others","#enum \n11.食材|Food_Material\n12.建材|Building_Material\n13.基础材料|Basic_Material\n14.药材|Medicine_Material\n21.雨具|Rain_Gear\n22.衣服|Clothes\n23.小物件|Mini_Item\n24.伙伴装备|Friend_Equipment\n31.药品|Medicine\n32.菜品|Cuisine\n33.图纸菜谱药方|Learning_Function_Item\n35.道具|Special_Function_Item\n36.其他|Others\n\n","#enum \n0.不可转移|No\n1.可转移|Yes",null,"#enum \n1.银子|SilverTael\n2.金沙|GoldIngot",null,null,null,"-1表示无购买上限限制","指非桃谷仓库中的叠加上限","#enum \n0.不可丢弃|No\n1.可丢弃|Yes","#enum\n1.七品|Qipin\n2.六品|Liupin\n3.五品|Wupin\n4.四品|Sipin\n5.三品|Sanpin\n6.二品|Erpin\n7.一品|Yipin"]
[{"$nulls":4},"#"]
[null,null,"编号","名称","策划用","关联子表","子表编号","仓库类别","仓库子类别","转移性","可出售","出售货币","出售价格","购买货币","购买价格","购买上限","叠加上限","可丢弃","品级","图标","物品描述","来源描述"]
[null,null,"Id","Name",null,"RelatedTable","RelatedId","StockType","StockSecondaryType","Transfer","Sell","SellMoney","SellPrice","BuyMoney","BuyPrice","PurchaseMax","SuperpositionMax","AbleThrow","Grade","Icon","Description","GetMethod"]
[null,null,"int","string",null,"int","int","int","int","int","int","int","int","int","int","int","long","int","int","string","string","string"]
[null,null,1001,"基础食物",1001,1,2001,0,0,0,0,0,0,0,0,0,99999999,0,1,"AllItem_1001","用于居民们日常消耗的食物，来源十分广泛","采集，种植"]
[null,null,1002,"露水",1002,1,1001,3,36,1,0,0,0,0,0,0,99999999,0,2,"AllItem_1002","空气中的水蒸气凝结在清晨或雨后的植物上便成为亮闪闪的小水珠，是十分洁净的水源","摇树、采集"]
[null,null,1003,"清水",1003,1,1002,0,0,0,0,0,0,0,0,0,99999999,1,1,"AllItem_1003","清澈的、可饮用的水源","水井，雨雪"]
[null,null,1004,"野果",1004,1,3001,1,11,0,0,0,0,0,0,0,999,1,1,"AllItem_1004","野外常见的果子，个头很小，味道有点酸","野果"]
[null,null,1005,"粉桃",1005,1,3002,1,11,1,0,0,0,0,0,0,999,1,1,"AllItem_1005","粉色的果皮，白色的果肉，清甜的果汁抵消盛夏的暑气！","桃树"]
[null,null,1006,"红桃",1006,1,3003,1,11,1,0,0,0,0,0,0,999,1,2,"AllItem_1006","桃中精品！桃谷在桃公主！","桃树"]
[null,null,1007,"紫桃",1007,1,3004,1,11,0,1,1,10,0,0,0,999,1,3,"AllItem_1007","集天地之灵气，凝日月之精华，在那个特殊的夜晚才能在揭开紫桃神秘的面纱","桃树"]
[null,null,1008,"萝卜",1008,1,6002,1,12,0,0,0,0,1,3,-1,999,1,1,"AllItem_1008","神奇！可食用部分居然埋在土里！","萝卜"]
[null,null,1009,"桑叶",1009,1,4001,1,12,0,0,0,0,0,0,0,999999,1,1,"AllItem_1009","养蚕的话一定要多多准备桑叶","桑树"]
[null,null,1010,"梨",1010,1,4002,1,12,0,0,0,0,0,0,0,999999,1,1,"AllItem_1010"]
[null,null,1011,"木头",1011,1,4003,1,12,0,0,0,0,0,0,0,999999,1,1,"AllItem_1011","无需多说，缺树枝的时候就去砍树吧","树、捡"]
[null,null,1012,"木板",1012,1,4004,1,12,1,1,1,1,1,5,-1,999999,1,1,"AllItem_1012","方方正正的木板，堆叠在一起的时候十分整齐","合成"]
[null,null,1013,"石头",1013,1,4005,1,12,0,0,0,0,0,0,0,999999,1,1,"AllItem_1013","一些碎石","石矿、捡"]
[null,null,1014,"石块",1014,1,4006,1,12,1,1,1,1,1,5,-1,999999,1,1,"AllItem_1014","方方正正的石块，堆叠在一起的时候十分整齐","合成"]
[null,null,1015,"亚麻",1015,1,4007,1,12,1,1,1,1,1,5,-1,999999,1,1,"AllItem_1015",null,"采集"]
[null,null,1016,"亚麻布",1016,1,4008,1,12,1,1,1,1,1,5,-1,999999,1,1,"AllItem_1016",null,"合成"]
[null,null,1017,"亚麻绳",1017,1,4009,1,12,1,1,1,1,1,5,-1,999999,1,1,"AllItem_1017",null,"合成"]
[null,null,1018,"羊肉",1018,1,3006,1,11,0,0,0,0,0,0,0,999,1,2,"AllItem_1018",null,"屠宰"]
[null,null,1019,"米",1019,1,3007,1,11,0,0,0,0,0,0,0,999,1,1,"AllItem_1019","粒粒皆辛苦呀！","合成"]
[null,null,1020,"水稻",1020,1,6001,1,13,0,1,1,1,0,0,0,999999,1,1,"AllItem_1020",null,"种植"]
[null,null,1021,"萝卜种子",1021,1,4011,1,13,0,0,0,0,1,2,-1,999999,1,1,"AllItem_1021",null,"购买、掉落"]
[null,null,1022,"水稻种子",1022,1,4012,1,13,0,0,0,0,1,2,-1,999999,1,1,"AllItem_1022",null,"购买、掉落"]
[null,null,1023,"姜",1023,1,3008,1,11,0,0,0,0,0,0,0,999999,1,1,"AllItem_1023",null,"掉落"]
[null,null,1024,"香蒲草",1024,1,5001,1,14,0,0,0,0,0,0,0,999999,1,1,"AllItem_1024",null,"采集"]
[null,null,1025,"粗皮",1025,1,4013,1,13,0,0,0,0,0,0,0,999999,1,1,"AllItem_1025","未经加工的皮料，散发着非常原生态的味道","掉落"]
[null,null,1026,"草料",1026,1,4014,1,13,0,0,0,0,0,0,0,999999,1,1,"AllItem_1026","草料","采集"]
[null,null,1027,"青虫",1027,1,4015,1,13,1,0,0,0,0,0,0,999999,1,1,"AllItem_1027","青虫","掉落"]
[null,null,1028,"竹料",1028,1,4016,1,13,0,0,0,0,0,0,0,999999,1,1,"AllItem_1028","竹料","砍伐毛竹"]
[null,null,1029,"竹笋",1029,1,4017,1,13,1,0,0,0,0,0,0,999999,1,1,"AllItem_1029","竹笋","采集毛竹"]
[null,null,1030,"竹条",1030,1,4018,1,13,0,0,0,0,0,0,0,999999,1,1,"AllItem_1030","竹条","合成"]
[null,null,1031,"野菜",1031,1,4019,1,13,0,0,0,0,0,0,0,999999,1,1,"AllItem_1031","野菜","采集野菜"]
[null,null,1032,"花岗石料",1032,1,4020,1,13,0,0,0,0,0,0,0,999999,1,1,"AllItem_1032","花岗石料","采集花岗石"]
[null,null,1033,"花岗石块",1033,1,4021,1,13,0,0,0,0,0,0,0,999999,1,1,"AllItem_1033","花岗石块","合成"]
[null,null,1034,"大理石料",1034,1,4022,1,13,0,0,0,0,0,0,0,999999,1,1,"AllItem_1034","大理石料","采集大理石"]
[null,null,1035,"大理石块",1035,1,4023,1,13,0,0,0,0,0,0,0,999999,1,1,"AllItem_1035","大理石块","合成"]
[null,null,1036,"硬木材",1036,1,4024,1,13,0,0,0,0,0,0,0,999999,1,1,"AllItem_1036","硬木材","砍伐"]
[null,null,1037,"硬木板",1037,1,4025,1,13,0,0,0,0,0,0,0,999999,1,1,"AllItem_1037","硬木板","合成"]
[null,null,1038,"软木材",1038,1,4026,1,13,0,0,0,0,0,0,0,999999,1,1,"AllItem_1038","软木材","砍伐"]
[null,null,1039,"软木板",1039,1,4027,1,13,0,0,0,0,0,0,0,999999,1,1,"AllItem_1039","软木板","合成"]
[null,null,1040,"木心",1040,1,4028,1,13,0,0,0,0,0,0,0,999999,1,1,"AllItem_1040","木心","掉落"]
[null,null,1041,"碎铁料",1041,1,4029,1,13,0,0,0,0,0,0,0,999999,1,1,"AllItem_1041","碎铁料","挖矿"]
[null,null,1042,"铁块",1042,1,4030,1,13,0,0,0,0,0,0,0,999999,1,1,"AllItem_1042","铁块","挖矿"]
[null,null,1043,"碎银料",1043,1,4031,1,13,0,0,0,0,0,0,0,999999,1,1,"AllItem_1043","碎银料","挖矿"]
[null,null,1044,"银块",1044,1,4032,1,13,0,0,0,0,0,0,0,999999,1,1,"AllItem_1044","银块","挖矿"]
[null,null,1045,"碎金料",1045,1,4033,1,13,0,0,0,0,0,0,0,999999,1,1,"AllItem_1045","碎金料","挖矿"]
[null,null,1046,"金锭",1046,1,4034,1,13,0,1,1,1000,0,0,0,999999,0,3,"AllItem_1046","金锭"]
[null,null,1047,"桃泥",1047,1,4035,1,13,0,0,0,0,0,0,0,999999,1,1,"AllItem_1047","桃泥"]
[null,null,1048,"松香",1048,1,5002,1,13,0,0,0,0,0,0,0,999999,1,1,"AllItem_1048","松香"]
[null,null,1049,"滑石粉",1049,1,5003,1,13,0,0,0,0,0,0,0,999999,1,1,"AllItem_1049","滑石粉"]
[null,null,1050,"草药",1050,1,5004,1,13,0,0,0,0,0,0,0,999999,1,1,"AllItem_1050","草药"]
[null,null,1051,"田七",1051,1,5005,1,13,0,0,0,0,0,0,0,999999,1,1,"AllItem_1051","田七"]
[null,null,1052,"棕绒",1052,1,4036,1,13,0,0,0,0,0,0,0,999999,1,1,"AllItem_1052","棕绒","棕树"]
[null,null,2001,"桃树树苗",2001,2,1001,3,36,0,0,0,0,0,0,0,999,0,1,"AllItem_2001","桃树幼苗，种植后可长大成为桃树","掉落"]
[null,null,2002,"桑树树苗",2002,2,1002,3,36,0,0,0,0,0,0,0,999,0,1,"AllItem_2002","桑树幼苗，种植后可长大成为桑树","掉落"]
[null,null,2003,"白茅幼苗",2003,2,1003,3,36,0,0,0,0,0,0,0,999,0,1,"AllItem_2003","茅草幼苗，种植后可长大成为茅草","掉落"]
[null,null,2004,"亚麻幼苗",2004,2,1004,3,36,0,0,0,0,0,0,0,999,0,1,"AllItem_2004","亚麻幼苗，种植后可长大成为茅草","掉落"]
[null,null,2005,"加速道具1",2005,2,2001,3,35,0,0,0,0,0,0,0,999,0,2,"AllItem_2005","加速道具，使用后可缩短制作时间15分钟","商城购买"]
[null,null,2006,"加速道具2",2006,2,2002,3,35,0,0,0,0,0,0,0,999,0,3,"AllItem_2006","加速道具，使用后可缩短制作时间30分钟","商城购买"]
[null,null,2007,"菜谱-萝卜烧羊肉",2007,2,3001,3,33,0,0,0,0,0,0,0,999,1,2,"AllItem_2007","萝卜烧羊肉的菜谱，需要厨师才可学习","掉落"]
[null,null,2008,"药方-生脉散",2008,2,3002,3,33,0,0,0,0,0,0,0,999,1,2,"AllItem_2008","生脉散的药方，需要药师才可学习","掉落"]
[null,null,2009,"加速道具3",2009,2,2003,3,35,0,0,0,0,0,0,0,999,1,4,"AllItem_2009","加速道具，使用后可缩短制作时间60分钟","商城购买"]
[null,null,2010,"效率增加道具1",2010,2,4001,3,35,0,0,0,0,0,0,0,999,1,2,"AllItem_2010","增加效率的道具，使用后可使效率增加25%","商城购买"]
[null,null,2011,"效率增加道具2",2011,2,4002,3,35,0,0,0,0,0,0,0,999,1,3,"AllItem_2011","增加效率的道具，使用后可使效率增加50%","商城购买"]
[null,null,2012,"效率增加道具3",2012,2,4003,3,35,0,0,0,0,0,0,0,999,1,4,"AllItem_2012","增加效率的道具，使用后可使效率增加100%","商城购买"]
[null,null,2013,"野果幼苗",2013,2,1005,3,36,0,0,0,0,0,0,0,999,1,1,"AllItem_2013","野果幼苗，长大后会成为野果","掉落"]
[null,null,2014,"杂草幼苗",2014,2,1006,3,36,0,0,0,0,0,0,0,999,1,1,"AllItem_2014","杂草幼苗，长大后会成为杂草","掉落"]
[null,null,2015,"香蒲幼苗",2015,2,1007,3,36,0,0,0,0,0,0,0,999,1,1,"AllItem_2015","香蒲幼苗，长大后会成为香蒲","掉落"]
[null,null,2016,"毛竹竹苗",2016,2,1008,3,36,0,0,0,0,0,0,0,999,1,1,"AllItem_2016","毛竹竹苗，长大后会成为毛竹","掉落"]
[null,null,2017,"柳树树苗",2017,2,1009,3,36,0,0,0,0,0,0,0,999,1,1,"AllItem_2017","柳树树苗，长大后会成为柳树","掉落"]
[null,null,2018,"野菜幼苗",2018,2,1010,3,36,0,0,0,0,0,0,0,999,1,1,"AllItem_2018","野菜幼苗，长大后会成为野菜","掉落"]
[null,null,2019,"棕树树苗",2019,2,1011,3,36,0,0,0,0,0,0,0,999,1,1,"AllItem_2019","棕树树苗，长大后会成为棕树","掉落"]
[null,null,2020,"松树树苗",2020,2,1012,3,36,0,0,0,0,0,0,0,999,1,1,"AllItem_2020","松树树苗，长大后会成为松树","掉落"]
[null,null,2021,"棠梨树苗",2021,2,1013,3,36,0,0,0,0,0,0,0,999,1,1,"AllItem_2021","棠梨树苗，长大后会成为棠梨","掉落"]
[null,null,2022,"梅树树苗",2022,2,1014,3,36,0,0,0,0,0,0,0,999,1,1,"AllItem_2022","梅树树苗，长大后会成为梅树","掉落"]
[null,null,2023,"桢楠树苗",2023,2,1015,3,36,0,0,0,0,0,0,0,999,1,1,"AllItem_2023","桢楠树苗，长大后会成为桢楠","掉落"]
[null,null,2024,"榕树树苗",2024,2,1016,3,36,0,0,0,0,0,0,0,999,1,1,"AllItem_2024","榕树树苗，长大后会成为榕树","掉落"]
[null,null,3001,"普通家常菜",3001,3,1,3,32,0,1,1,1,0,0,0,999,1,1,"AllItem_3001","没有按照菜谱制作出来的普通家常菜","厨房制作"]
[null,null,3002,"萝卜饭",3002,3,1001,3,32,0,1,1,10,0,0,0,99,1,1,"AllItem_3002","农家朴素的萝卜饭，非常顶饱","厨房制作"]
[null,null,3003,"佳·萝卜饭",3003,3,1002,3,32,0,1,1,10,0,0,0,99,1,1,"AllItem_3002","农家朴素的萝卜饭，非常顶饱","厨房制作"]
[null,null,3004,"萝卜烧羊肉",3004,3,2001,3,32,0,1,1,15,0,0,0,99,1,2,"AllItem_3003","益气滋补的萝卜烧羊肉","厨房制作"]
[null,null,3005,"佳·萝卜烧羊肉",3005,3,2002,3,32,0,1,1,15,0,0,0,99,1,2,"AllItem_3003","益气滋补的萝卜烧羊肉","厨房制作"]
[null,null,3006,"红掌拨清波",3006,3,3001,3,32,0,1,1,10,0,0,0,99,1,1,"AllItem_3004","鲜艳的红萝卜飘在清澈的蔬菜汤上,多么朴素的菜肴啊!","厨房制作"]
[null,null,3007,"佳·红掌拨清波",3007,3,3002,3,32,0,1,1,10,0,0,0,99,1,1,"AllItem_3004","鲜艳的红萝卜飘在清澈的蔬菜汤上,多么朴素的菜肴啊!","厨房制作"]
[null,null,4001,"药渣",4001,4,1,3,31,1,1,1,5,0,0,0,999,1,1,"AllItem_4001","炼药失败获得的药渣，对外伤有少许效果但伤身","合成"]
[null,null,4002,"金疮药",4002,4,1001,3,31,1,1,1,10,1,20,-1,99,0,1,"AllItem_4002","治疗外伤的普通药品","合成，购买"]
[null,null,4003,"佳·金疮药",4003,4,1002,3,31,1,1,1,10,1,20,-1,99,0,1,"AllItem_4003","治疗外伤的普通药品","合成，购买"]
[null,null,4004,"接骨散",4004,4,1003,3,31,1,1,1,15,1,30,-1,99,0,2,"AllItem_4004","治疗外伤的药品，效果不错","合成，购买"]
[null,null,4005,"佳·接骨散",4005,4,1004,3,31,1,1,1,15,1,30,-1,99,0,2,"AllItem_4005","治疗外伤的药品，效果不错","合成，购买"]
[null,null,4006,"香蒲汤",4006,4,2001,3,31,1,1,1,10,1,20,-1,99,0,1,"AllItem_4006","治疗内疾的普通药品","合成，购买"]
[null,null,4007,"佳·香蒲汤",4007,4,2002,3,31,1,1,1,10,1,20,-1,99,0,1,"AllItem_4007","治疗内疾的普通药品","合成，购买"]
[null,null,4008,"屠苏药",4008,4,2003,3,31,1,1,1,15,1,30,-1,99,0,2,"AllItem_4008","治疗内疾的药品，效果不错","合成，购买"]
[null,null,4009,"佳·屠苏药",4009,4,2004,3,31,1,1,1,15,1,30,-1,99,0,2,"AllItem_4009","治疗内疾的药品，效果不错","合成，购买"]
[null,null,4010,"生脉散",4010,4,3001,3,31,1,1,1,50,0,0,0,99,1,1,"AllItem_4010","一种可以使人力量短时间变强的灵药","合成"]
[null,null,4011,"佳·生脉散",4011,4,3002,3,31,1,1,1,50,0,0,0,99,1,1,"AllItem_4011","一种可以使人力量短时间变强的灵药","合成"]
[null,null,5001,"护甲1",5001,5,1001,2,24,0,1,1,20,0,1,2,9,0,1,"AllItem_5001","小护甲","掉落"]
[null,null,5002,"武器1",5002,5,2001,2,24,0,1,1,20,0,1,2,9,0,1,"AllItem_5002","小武器","掉落"]
[null,null,5003,"戒指1",5003,5,3001,2,24,0,1,1,20,0,1,2,9,0,1,"AllItem_5003","小戒指","掉落"]
[null,null,5004,"腰带1",5004,5,4001,2,24,0,1,1,20,0,1,2,9,0,1,"AllItem_5004","小腰带","掉落"]
[null,null,5005,"玉佩1",5005,5,5001,2,24,0,1,1,20,0,1,2,9,0,1,"AllItem_5005","小玉佩","掉落"]
[null,null,5006,"鞋子1",5006,5,6001,2,24,0,1,1,20,0,1,2,9,0,1,"AllItem_5006","小鞋子","掉落"]
[null,null,6001,"银两",6001,0,0,0,0,0,0,0,0,0,0,0,9999999,0,1,"AllItem_6001","日常通用货币","交易"]
[null,null,6002,"金元",6002,0,0,0,0,0,0,0,0,0,0,0,9999999,0,4,"AllItem_6002","极具价值的通用货币","充值"]

{"sheet":"#表格说明","index":1,"n_rows":48,"n_cols":5,"rows_kept":48,"cut":false,"hidden":false,"merged":[[2,1,2,4]]}
[]
[null,"一、表格概述"]
[null,"        配置桃谷中所有物品的基础通用属性，在具体物品类型的表格中配置其特殊属性\n        例如衣服类型的物品有保暖度、清凉度等属性，这些与具体类型相关的属性配置在具体类型的物品表中"]
[]
[null,"二、表格参数解释"]
[]
[]
[null,"编号","Id","int"]
[null,"名称","Name","string"]
[null,"关联子表","RelatedTable","int","\n该物品具体类型对应的表格\n1.Material\n2.FunctionItem\n3.Cuisine\n4.Medicine\n5.Equipment"]
[null,"子表编号","RelatedId","int","在具体表格中的编号"]
[null,"仓库类别","StockType","int","该物品在仓库中的类别"]
[null,"仓库子类别","StockSecondaryType","int","该物品在仓库中的子类别"]
[null,"转移性","Transfer","int","该物品是否可从仓库放入背包，\n1 可以\n0 不可以"]
[null,"可出售","Sell","int","该物品是否可出售，\n1 可出售\n0 不可出售"]
[null,"出售货币","SellMoney","int"]
[null,"出售价格","SellPrice","int"]
[null,"购买货币","BuyMoney","int"]
[null,"购买价格","BuyPrice","int"]
[null,"购买上限","PurchaseMax","int","若该物品在整个游戏进程里有购买上限限制，则将该限制配置在这个字段中"]
[null,"叠加上限","SuperpositionMax","long","只在仓库以外的其他地方(背包\\营地仓库\\运输时的货物清单等)的叠加上限"]
[null,"可丢弃","AbleThrow","int"]
[null,"品级","Grade","int"]
[null,"图标","Icon","string"]
[null,"物品描述","Description","string"]
[null,"来源描述","GetMethod","string"]
{"$rows_empty":7}
[null,null,"快速查找物品id"]
[null,null,"在下方输入物品名称","下方会显示id"]
[null,null,"香蒲草",{"$f":"VLOOKUP(C36,Sheet1!D:E,2,FALSE)","v":1024}]
[null,null,"草药",{"$f":"VLOOKUP(C37,Sheet1!D:E,2,FALSE)","v":1050}]
[null,null,"草料",{"$f":"VLOOKUP(C38,Sheet1!D:E,2,FALSE)","v":1026}]
[null,null,"花岗石料",{"$f":"VLOOKUP(C39,Sheet1!D:E,2,FALSE)","v":1032}]
[]
[]
[]
[]
[null,null,"快速查找id对应物品"]
[null,null,"在下方输入id","下方显示名称"]
[null,null,1037,{"$f":"VLOOKUP(C46,Sheet1!C:D,2,FALSE)","v":"硬木板"}]
[null,null,1039,{"$f":"VLOOKUP(C47,Sheet1!C:D,2,FALSE)","v":"软木板"}]
[null,null,1035,{"$f":"VLOOKUP(C48,Sheet1!C:D,2,FALSE)","v":"大理石块"}]