{"text_format":"2","workbook":"xlsx","n_sheets":2,"sheets":["Sheet1","#表格说明"],"not_rendered":{"charts":0,"images":0,"macros":0,"external_links":1,"defined_names":0,"comments":0,"pivot_tables":0},"unopened":[],"bounds":{"document_bytes":16777216,"sheet_cells":100000,"run_cost":"one","rows_first":2000,"rows_last":500,"rows_between":2000,"halvings":0,"cell_chars":16384,"cell_head_chars":4096},"cells_cut":0,"cells_raw":0,"read":"whole","date_system":"1900"}

{"sheet":"Sheet1","index":0,"n_rows":20,"n_cols":8,"rows_kept":20,"cut":false,"hidden":false,"merged":[]}
[null,null,null,"AllItem.xlsx Id",null,"#enum\n1.没有描述|No_Desctription\n2.少|Few\n3.稀|Fewer\n4.罕|Rare","用于自动关联AllItem表用,不可删除"]
[{"$nulls":6},"#","#"]
[null,null,"编号","物品编号","掉量区间","掉量描述","配表用","策划备注"]
[null,null,"Id","ItemId","DropAmount","DropDescription"]
[null,null,"int","int","int[]","int"]
[null,null,1001,{"$f":"VLOOKUP(G6,[1]Sheet1!$D:$E,2,FALSE)","v":1005},"15,20",2,"粉桃","桃树-夏"]
[null,null,1002,{"$f":"VLOOKUP(G7,[1]Sheet1!$D:$E,2,FALSE)","v":1006},"5,8",3,"红桃","桃树-夏"]
[null,null,1003,{"$f":"VLOOKUP(G8,[1]Sheet1!$D:$E,2,FALSE)","v":1005},"15,20",2,"粉桃","桃树-秋"]
[null,null,1004,{"$f":"VLOOKUP(G9,[1]Sheet1!$D:$E,2,FALSE)","v":1006},"15,20",2,"红桃","桃树-秋"]
[null,null,1005,{"$f":"VLOOKUP(G10,[1]Sheet1!$D:$E,2,FALSE)","v":1004},"5,8",2,"野果","野果丛"]
[null,null,1006,{"$f":"VLOOKUP(G11,[1]Sheet1!$D:$E,2,FALSE)","v":1027},"2,4",2,"青虫","杂草"]
[null,null,1007,{"$f":"VLOOKUP(G12,[1]Sheet1!$D:$E,2,FALSE)","v":1009},"15,20",2,"桑叶","桑树-采集"]
[null,null,1008,{"$f":"VLOOKUP(G13,[1]Sheet1!$D:$E,2,FALSE)","v":1050},"15,20",2,"草药","白茅"]
[null,null,1009,{"$f":"VLOOKUP(G14,[1]Sheet1!$D:$E,2,FALSE)","v":1015},100150,2,"亚麻","亚麻"]
[null,null,1010,{"$f":"VLOOKUP(G15,[1]Sheet1!$D:$E,2,FALSE)","v":1024},100150,2,"香蒲草","香蒲草"]
[null,null,1011,{"$f":"VLOOKUP(G16,[1]Sheet1!$D:$E,2,FALSE)","v":1029},100150,2,"竹笋","毛竹"]
[null,null,1012,{"$f":"VLOOKUP(G17,[1]Sheet1!$D:$E,2,FALSE)","v":1031},100150,2,"野菜","野菜"]
[null,null,1013,{"$f":"VLOOKUP(G18,[1]Sheet1!$D:$E,2,FALSE)","v":1049},100150,2,"滑石粉","石\\花岗石\\铁银金矿\\大理石"]
[null,null,1014,{"$f":"VLOOKUP(G19,[1]Sheet1!$D:$E,2,FALSE)","v":1040},100150,2,"木心","梅树\\桢楠\\榕树"]
[null,null,1015,{"$f":"VLOOKUP(G20,[1]Sheet1!$D:$E,2,FALSE)","v":1052},100150,2,"棕绒","棕树-采集"]

{"sheet":"#表格说明","index":1,"n_rows":8,"n_cols":5,"rows_kept":8,"cut":false,"hidden":false,"merged":[]}
[]
[]
[]
[]
[null,"编号","Id","int"]
[null,"物品编号","ItemId","int","填写AllItem表的物品id"]
[null,"掉量区间","DropAmount","int[]","填写物品掉量区间，该区间指的是资源从开始采集至完成采集全过程中可能掉落的物品数量"]
[null,"掉量描述","DropDescription","int"]